{"text_format":"1","workbook":"xlsx","n_sheets":4,"sheets":["Inndata timer","Tabell","Timeverksrapport","Prisliste byggesett"],"not_rendered":{"charts":0,"images":35,"macros":1,"external_links":0,"defined_names":16,"comments":0,"pivot_tables":0},"unopened":[],"bounds":{"document_bytes":16777216,"sheet_cells":100000,"rows_first":2000,"rows_last":500,"rows_between":2000,"halvings":0,"cell_chars":16384,"cell_head_chars":4096},"cells_cut":0,"cells_raw":0,"read":"whole","date_system":"1900"}

{"sheet":"Inndata timer","index":0,"n_rows":51,"n_cols":28,"rows_kept":51,"cut":false,"hidden":true,"merged":[[1,0,1,4],[5,0,5,4],[20,0,20,4],[29,0,29,4],[37,0,37,4]]}
[]
["6.1 - Rigg og drift",null,null,null,null,null,null,null,null,null,"Lim inn alt i celle K3:",null,3,4,5,6,7,8,9,10,11,12,13,14,15,16,17,18]
[null,"6.1.20 - Rigg og drift av byggeplass",null,null,null,1,{"$f":"IF(H3=1,I3,)","v":0},{"$f":"COUNT(I3)","v":0},{"$f":"VLOOKUP(\"6.1.20 - Rigg og drift av byggeplass\",$K$3:$AD$115,5,FALSE)","v":{"$error":"#N/A"}}]
[null,"6.1.40 - Riving og klargjøring",null,null,null,2,0,0,{"$f":"VLOOKUP(\"6.1.40 - Riving og klargjøring\",$K$3:$AD$115,5,FALSE)","v":{"$error":"#N/A"}}]
[null,"6.1.50 - Stillasjer",null,null,null,3,0,0,{"$f":"VLOOKUP(\"6.1.50 - Stillasjer\",$K$3:$AD$115,5,FALSE)","v":{"$error":"#N/A"}}]
["6.4 - Tett råbygg",null,null,null,null,4]
[null,"6.4.10 - Svillunderlag og bunnsvill",null,null,null,5,0,0,{"$f":"VLOOKUP(\"6.4.10 - Svillunderlag og bunnsvill\",$K$3:$AD$115,5,FALSE)","v":{"$error":"#N/A"}}]
[null,"6.4.20 - Bindingsverk i yttervegger",null,null,null,6,0,0,{"$f":"VLOOKUP(\"6.4.20 - Bindingsverk i yttervegger\",$K$3:$AD$115,5,FALSE)","v":{"$error":"#N/A"}}]
[null,"6.4.22 - Bindingsverk i innvendige bærevegger",null,null,null,7,0,0,{"$f":"VLOOKUP(\"6.4.22 - Bindingsverk i innvendige bærevegger\",$K$3:$AD$115,5,FALSE)","v":{"$error":"#N/A"}}]
[null,"6.4.24 - Søyler og dragere",null,null,null,8,0,0,{"$f":"VLOOKUP(\"6.4.24 - Søyler og dragere\",$K$3:$AD$115,5,FALSE)","v":{"$error":"#N/A"}}]
[null,"6.4.30 - Bjelkelag",null,null,null,9,0,0,{"$f":"VLOOKUP(\"6.4.30 - Bjelkelag\",$K$3:$AD$115,5,FALSE)","v":{"$error":"#N/A"}}]
[null,"6.4.32 - Takbjelkelag",null,null,null,10,0,0,{"$f":"VLOOKUP(\"6.4.32 - Takbjelkelag\",$K$3:$AD$115,5,FALSE)","v":{"$error":"#N/A"}}]
[null,"6.4.34 - Plattformgulv",null,null,null,11,0,0,{"$f":"VLOOKUP(\"6.4.34 - Plattformgulv\",$K$3:$AD$115,5,FALSE)","v":{"$error":"#N/A"}}]
[null,"6.4.40 - Taksperrer",null,null,null,12,0,0,{"$f":"VLOOKUP(\"6.4.40 - Taksperrer\",$K$3:$AD$115,5,FALSE)","v":{"$error":"#N/A"}}]
[null,"6.4.42 - Takstoler",null,null,null,13,0,0,{"$f":"VLOOKUP(\"6.4.42 - Takstoler\",$K$3:$AD$115,5,FALSE)","v":{"$error":"#N/A"}}]
[null,"6.4.50 - Vindtettplater/vindsperre og sløyfer",null,null,null,14,0,0,{"$f":"VLOOKUP(\"6.4.50 - Vindtettplater/vindsperre og sløyfer\",$K$3:$AD$115,5,FALSE)","v":{"$error":"#N/A"}}]
[null,"6.4.52 - Undertak og sløyfer",null,null,null,15,0,0,{"$f":"VLOOKUP(\"6.4.52 - Undertak og sløyfer\",$K$3:$AD$115,5,FALSE)","v":{"$error":"#N/A"}}]
[null,"6.4.60 - Vindu og dører med tetting",null,null,null,16,0,0,{"$f":"VLOOKUP(\"6.4.60 - Vindu og dører med tetting\",$K$3:$AD$115,5,FALSE)","v":{"$error":"#N/A"}}]
[null,"6.4.70 - Ledig",null,null,null,17,0,0,{"$f":"VLOOKUP(\"6.4.70 - Ledig\",$K$3:$AD$115,5,FALSE)","v":{"$error":"#N/A"}}]
[null,"6.4.80 - Montering elementer",null,null,null,18,0,0,{"$f":"VLOOKUP(\"6.4.80 - Montering elementer\",$K$3:$AD$115,5,FALSE)","v":{"$error":"#N/A"}}]
["6.5 - Fasade",null,null,null,null,19]
[null,"6.5.20 - Utvendig kledning med lekter",null,null,null,20,0,0,{"$f":"VLOOKUP(\"6.5.20 - Utvendig kledning med lekter\",$K$3:$AD$115,5,FALSE)","v":{"$error":"#N/A"}}]
[null,"6.5.22 - Omramming dør/vindu",null,null,null,21,0,0,{"$f":"VLOOKUP(\"6.5.22 - Omramming dør/vindu\",$K$3:$AD$115,5,FALSE)","v":{"$error":"#N/A"}}]
[null,"6.5.24 - Hjørnebord, dekkeforkanter, fasadedekor, etc.",null,null,null,22,0,0,{"$f":"VLOOKUP(\"6.5.24 - Hjørnebord, dekkeforkanter, fasadedekor, etc.\",$K$3:$AD$115,5,FALSE)","v":{"$error":"#N/A"}}]
[null,"6.5.30 - Gesims- gavlkasser, forkantbord og vindskier",null,null,null,23,0,0,{"$f":"VLOOKUP(\"6.5.30 - Gesims- gavlkasser, forkantbord og vindskier\",$K$3:$AD$115,5,FALSE)","v":{"$error":"#N/A"}}]
[null,"6.5.40 - Steinlekter, takrenner og taktekking",null,null,null,24,0,0,{"$f":"VLOOKUP(\"6.5.40 - Steinlekter, takrenner og taktekking\",$K$3:$AD$115,5,FALSE)","v":{"$error":"#N/A"}}]
[null,"6.5.50 - Terrassegulv, rekkverk og utv. trapper",null,null,null,25,0,0,{"$f":"VLOOKUP(\"6.5.50 - Terrassegulv, rekkverk og utv. trapper\",$K$3:$AD$115,5,FALSE)","v":{"$error":"#N/A"}}]
[null,"6.5.60 - Ledig",null,null,null,26,0,0,{"$f":"VLOOKUP(\"6.5.60 - Ledig\",$K$3:$AD$115,5,FALSE)","v":{"$error":"#N/A"}}]
[null,"6.5.90 - Stålpipe",null,null,null,27,0,0,{"$f":"VLOOKUP(\"6.5.90 - Stålpipe\",$K$3:$AD$115,5,FALSE)","v":{"$error":"#N/A"}}]
["6.6 - Klart for rør og EL",null,null,null,null,28]
[null,"6.6.10 - Isolasjon og dampsperre i yttervegg og yttertak",null,null,null,29,0,0,{"$f":"VLOOKUP(\"6.6.10 - Isolasjon og dampsperre i yttervegg og yttertak\",$K$3:$AD$115,5,FALSE)","v":{"$error":"#N/A"}}]
[null,"6.6.14 - Isolasjon i innervegg og etasjeskillere",null,null,null,30,0,0,{"$f":"VLOOKUP(\"6.6.14 - Isolasjon i innervegg og etasjeskillere\",$K$3:$AD$115,5,FALSE)","v":{"$error":"#N/A"}}]
[null,"6.6.20 - Lekting av vegger og himling",null,null,null,31,0,0,{"$f":"VLOOKUP(\"6.6.20 - Lekting av vegger og himling\",$K$3:$AD$115,5,FALSE)","v":{"$error":"#N/A"}}]
[null,"6.6.30 - Bindingsverk i lettvegger",null,null,null,32,0,0,{"$f":"VLOOKUP(\"6.6.30 - Bindingsverk i lettvegger\",$K$3:$AD$115,5,FALSE)","v":{"$error":"#N/A"}}]
[null,"6.6.40 - Skyvedørskarmer",null,null,null,33,0,0,{"$f":"VLOOKUP(\"6.6.40 - Skyvedørskarmer\",$K$3:$AD$115,5,FALSE)","v":{"$error":"#N/A"}}]
[null,"6.6.50 - Rørsystem Ventilasjon og sentralstøvsuger",null,null,null,34,0,0,{"$f":"VLOOKUP(\"6.6.50 - Rørsystem Ventilasjon og sentralstøvsuger\",$K$3:$AD$115,5,FALSE)","v":{"$error":"#N/A"}}]
[null,"6.6.90 - Ledig",null,null,null,35,0,0,{"$f":"VLOOKUP(\"6.6.90 - Ledig\",$K$3:$AD$115,5,FALSE)","v":{"$error":"#N/A"}}]
["6.7 - Ferdigstillelse",null,null,null,null,36]
[null,"6.7.10 - Innvendige plater og panel",null,null,null,37,0,0,{"$f":"VLOOKUP(\"6.7.10 - Innvendige plater og panel\",$K$3:$AD$115,5,FALSE)","v":{"$error":"#N/A"}}]
[null,"6.7.20 - Gulvbord og parkett",null,null,null,38,0,0,{"$f":"VLOOKUP(\"6.7.20 - Gulvbord og parkett\",$K$3:$AD$115,5,FALSE)","v":{"$error":"#N/A"}}]
{"$rows_left_out":12}
{"sheet":"Tabell","index":1,"n_rows":111,"n_cols":61,"rows_kept":111,"cut":false,"hidden":true,"merged":[[1,0,1,4],[37,0,37,4],[5,0,5,4],[20,0,20,4],[29,0,29,4]]}
["Milepæler",null,null,null,null,null,1,2,3,4,5,6,7,8,9,10,11,12,13,14,15,16,17,18,19,20,21,22,23,24,25,26,27,28,29,30,31,32,33,34,35,36,37,38,39,40,41,42,43,44,45,46,47]
["6.1 - Rigg og drift",null,null,null,null,null,{"$f":"B59","v":"Velg garasjetype"},null,{"$f":"B61","v":"GA 101 S-W - Enkel garasje"},{"$f":"B62","v":"GA 102 S-W - Enkel garasje"},{"$f":"B63","v":"GA 103 V-W - Enkel garasje"},{"$f":"B64","v":"GA 104 HV-W - Enkel garasje"},{"$f":"B65","v":"GA 106 S-W - Enkel garasje"},{"$f":"B66","v":"GA 107 S-W - Enkel carport"},{"$f":"B67","v":"GA 108 S-W - Enkel garasje"},{"$f":"B68","v":"GA 109 S-W - Enkel garasje"},{"$f":"B69","v":"GA 111 F - Enkel carport"},{"$f":"B70","v":"GA 112 F - Enkel garasje"},{"$f":"$B71","v":"GA 201 S-W - Dobbel garasje"},{"$f":"$B72","v":"GA 202 S-W - Dobbel garasje"},{"$f":"$B73","v":"GA 203 V-W - Dobbel garasje"},{"$f":"$B74","v":"GA 204 HV-W - Dobbel garasje"},{"$f":"$B75","v":"GA 206 S-W - Dobbel garasje"},{"$f":"$B76","v":"GA 207 P - Enkel garasje m/ carpor"},{"$f":"$B77","v":"GA 208 S-W - Dobbel garasje"},{"$f":"$B78","v":"GA 209 S-W - Dobbel garasje"},{"$f":"$B79","v":"GA 211 F - Dobbel garasje"},{"$f":"$B80","v":"GA 301 S-W - Enkel garasje m/bod"},{"$f":"$B81","v":"GA 302 S-W - Enkel garasje m/bod"},{"$f":"$B82","v":"GA 303 V-W - Enkel garasje m/bod"},{"$f":"$B83","v":"GA 305 P - Enkel garasje m/bod"},{"$f":"$B84","v":"GA 307 P - Enkel garasje m/bod"},{"$f":"$B85","v":"GA 308 F - Dobbel garasje m/ bod"},{"$f":"$B86","v":"GA 309 P - Carport m/ bod"},{"$f":"$B87","v":"GA 310 F - Carport m/ bod"},{"$f":"$B88","v":"GA 311 F - Carport m/ bod"},{"$f":"$B89","v":"GA 401 S-A - Dobbel garasje m/ hems"},{"$f":"$B90","v":"GA 402 S-A - Dobbel garasje m/ hems"},{"$f":"$B91","v":"GA 403 S-A - Dobbel garasje m/ hems"},{"$f":"$B92","v":"GA 404 HV-A - Dobbel garasje m/ hems"},{"$f":"$B93","v":"GA 405 S-A - Dobbel garasje m/ hems"},{"$f":"$B94","v":0},{"$f":"$B95","v":0},{"$f":"$B96","v":0},{"$f":"$B97","v":0},{"$f":"$B98","v":0},{"$f":"$B99","v":0},{"$f":"$B100","v":0},{"$f":"$B101","v":0},{"$f":"$B102","v":0},{"$f":"$B103","v":0},{"$f":"$B104","v":0},34,3,null,null,null,null,null,null,51]
[null,"6.1.20 - Rigg og drift av byggeplass",null,null,null,1,0,null,0,0,0,0,0,0,0,0,0,0,0,0,0,0,0,0,0,0,0,0,0,0,0,0,0,0,0,0,0,0,0,0,0]
[null,"6.1.40 - Riving og klargjøring",null,null,null,2,0,null,0,0,0,0,0,0,0,0,0,0,0,0,0,0,0,0,0,0,0,0,0,0,0,0,0,0,0,0,0,0,0,0,0]
[null,"6.1.50 - Stillasjer",null,null,null,3,0,null,0,0,0,0,0,0,0,0,0,0,0,0,0,0,0,0,0,0,0,0,0,0,0,0,0,0,0,0,0,0,0,0,0]
["6.4 - Tett råbygg",null,null,null,null,4,0]
[null,"6.4.10 - Svillunderlag og bunnsvill",null,null,null,5,0,null,1.48,1.48,1.48,1.48,1.98,1.2,1.69,1.58,0.67,1.63,1.66,1.66,1.76,1.66,2.06,1.69,1.86,1.78,1.67,1.9,1.95,1.99,1.99,1.79,0.13,1.64,1.02,1.98,1.67,2.17,1.63,2,2.71]
[null,"6.4.20 - Bindingsverk i yttervegger",null,null,null,6,0,null,8.99,9.6999999999999993,8.08,8.99,12.74,5.04,11.36,1.8,6.86,13.62,11.15,10.99,9.89,12.33,15.19,13.8,14.42,3.26,13.88,11.91,13.54,11.35,13.53,13.35,17.84,11.82,8.25,15.99,14.32,16.670000000000002,14.76,15.25,19.989999999999998]
[null,"6.4.22 - Bindingsverk i innvendige bærevegger",null,null,null,7,0,null,0,0,0,0,0,0,0,0,0,0,0,0,0.68,0,0,0,0,0,0,0.05,0.08,0.06,0.08,7.0000000000000007E-2,1.5,0.03,0,0,0,0.08,0,0,0.1]
[null,"6.4.24 - Søyler og dragere",null,null,null,8,0,null,0,0,0,0,0.26,3.5,0.47,0,3.97,2.15,0,0.53,0.55000000000000004,0,0,1.59,0.47,0,3.43,0,0.26,0.53,0,0,1.93,2.48,1.99,0,0,0,0,0,1.74]
[null,"6.4.30 - Bjelkelag",null,null,null,9,0,null,0,0,0,0,0,0,0,0,0.7,0.79,0,0,0,0,0,0,0,0,0.94,0,0,0,0,0,0.96,0.65,0.83,0.77,0,0,0,0,0]
[null,"6.4.32 - Takbjelkelag",null,null,null,10,0,null,0,0,0,0,0,0,0,0,0,0,0,0,0,0,0,0,0,0,0,0,0,0,0,0,0,0,0,0,0,0,0,0,0]
[null,"6.4.34 - Plattformgulv",null,null,null,11,0,null,0,0,0,0,0,0,0,0,2.39,3.73,0,0,0,0,0,0,0,0,3.15,0,0,0,0,0,3.4,0,2.38,2.19,2.81,3.92,3.2,3.47,4.53]
[null,"6.4.40 - Taksperrer",null,null,null,12,0,null,0,0,0,0,0,0,0,0,15,19.59,0,0,0,0,0,10.1,0,0,27.58,0,0,0,8.61,0,7.66,8.89,18.98,17.079999999999998,0,0,0,0,0]
[null,"6.4.42 - Takstoler",null,null,null,13,0,null,7.46,7.56,7.46,7.46,7.46,7.46,8.92,7.46,0.63,0.73,7.46,7.46,7.46,7.46,9.49,1.25,8.92,1.25,1.04,9.49,7.56,8.92,1.25,9.49,1.04,1.25,1.25,1.25,8.14,10.85,8.14,8.92,10.75]
[null,"6.4.50 - Vindtettplater/vindsperre og sløyfer",null,null,null,14,0,null,0,0,0,0,0,0,0,0,1.08,1.69,0,0,0,0,0,0,0,0,1.43,0,0,0,0,0,1.54,0,1.08,0.99,0,0,0,0,0]
[null,"6.4.52 - Undertak og sløyfer",null,null,null,15,0,null,1.21,3.52,1.39,3.82,4.9000000000000004,1.36,1.85,5.12,3.04,3.98,1.81,4.12,2.38,5.3,6.96,2.1,6.4,2.1,5.57,1.84,5.18,6.03,1.86,1.62,6.06,5.01,3.85,3.47,7.7,10.93,8.08,9.32,11.96]
[null,"6.4.60 - Vindu og dører med tetting",null,null,null,16,0,null,8.31,8.31,8.31,8.31,10.25,0,8.31,8.31,0,10.64,15.42,15.42,15.42,15.42,17.36,15.93,8.31,15.42,10.61,9.65,10.84,8.31,11.87,10.039999999999999,11.17,3.99,1.35,1.35,16.440000000000001,17.79,10.11,17.36,11.87]
[null,"6.4.70 - Ledig",null,null,null,17,0,null,0,0,0,0,0,0,0,0,0,0,0,0,0,0,0,0,0,0,0,0,0,0,0,0,0,0,0,0,0,0,0,0,0]
[null,"6.4.80 - Montering elementer",null,null,null,18,0,null,0,0,0,0,0,0,0,0,0,0,0,0,0,0,0,0,0,0,0,0,0,0,0,0,0,0,0,0,0,0,0,0,0]
["6.5 - Fasade",null,null,null,null,19,0]
[null,"6.5.20 - Utvendig kledning med lekter",null,null,null,20,0,null,9.8699999999999992,10.43,8.7200000000000006,9.77,14.9,5.62,1.2,2.17,9.91,35.11,12.26,12.06,10.75,13.68,16.97,15.46,16.22,3.93,26.86,12.87,14.43,12.06,13.87,37.26,27.96,12.3,20.88,29.16,15.92,18.579999999999998,1.55,16.39,12.5]
[null,"6.5.22 - Omramming dør/vindu",null,null,null,21,0,null,2.73,2.73,2.73,2.73,3.86,0,2.73,0.52,0,2.79,4.16,4.16,4.16,4.16,5.29,3.63,2.75,1.04,3.32,3.21,4.51,3.21,5.0599999999999996,3.4,3.91,1.82,0.46,0.46,4.92,4.5,4.26,5.6,3.99]
[null,"6.5.24 - Hjørnebord, dekkeforkanter, fasadedekor, etc.",null,null,null,22,0,null,1.28,1.28,1.28,1.28,1.28,1.82,1.28,0,2.65,0,1.28,1.28,1.28,1.28,1.28,2.2599999999999998,3.56,0,0.67,1.28,1.28,1.28,2.0099999999999998,1.45,0.59,1.56,0.59,1.18,1.28,1.28,1.41,1.28,1.28]
[null,"6.5.30 - Gesims- gavlkasser, forkantbord og vindskier",null,null,null,23,0,null,17.010000000000002,19.05,13.75,15.85,24.51,17.87,21.9,18.54,0,0,21.53,21.89,17.37,16.82,26.22,23.96,24.82,23.24,0,20.85,22.87,17.899999999999999,21.99,14.25,0,6.04,0,0,23.81,26.95,21.48,23.01,29.5]
[null,"6.5.40 - Steinlekter, takrenner og taktekking",null,null,null,24,0,null,10.130000000000001,7.26,13.99,12.63,8.36,7.21,11.96,17.41,0.99,0.88,10.16,10.16,22.41,12.05,12.22,11.95,11.22,9.4600000000000009,1.41,12.13,10.31,18,8.08,8.61,1.52,10.33,1.01,1.01,20.85,30.31,22.34,25.86,30.49]
[null,"6.5.50 - Terrassegulv, rekkverk og utv. trapper",null,null,null,25,0,null,0,0,0,0,0,0,0,0,6.43,0,0,0,0,0,0,0,0,0,0,0,0,0,0,0,0,4.99,0,0,0,0,0,0,0]
[null,"6.5.60 - Ledig",null,null,null,26,0,null,0,0,0,0,0,0,0,0,0,0,0,0,0,0,0,0,0,0,0,0,0,0,0,0,0,0,0,0,0,0,0,0,0]
[null,"6.5.90 - Stålpipe",null,null,null,27,0,null,0,0,0,0,0,0,0,0,0,0,0,0,0,0,0,0,0,0,0,0,0,0,0,0,0,0,0,0,0,0,0,0,0]
["6.6 - Klart for rør og EL",null,null,null,null,28,0]
[null,"6.6.10 - Isolasjon og dampsperre i yttervegg og yttertak",null,null,null,29,0,null,0,0,0,0,0,0,0,0,0,0,0,0,0,0,0,0,0,0,0,0,0,0,0,0,0,0,0,0,0,0,0,0,0]
[null,"6.6.14 - Isolasjon i innervegg og etasjeskillere",null,null,null,30,0,null,0,0,0,0,0,0,0,0,0,0,0,0,0,0,0,0,0,0,0,0,0,0,0,0,0,0,0,0,0,0,0,0,0]
[null,"6.6.20 - Lekting av vegger og himling",null,null,null,31,0,null,0,0,0,0,0,0,0,0,0,0,0,0,0,0,0,0,0,0,0,0,0,0,3.29,0,0,0,0,0,0,0,0,0,0]
[null,"6.6.30 - Bindingsverk i lettvegger",null,null,null,32,0,null,0,0,0,0,0,0,0,0,0,0,0,0,0,0,0,0,0,0,0,1.38,2.21,1.65,2.11,1.84,0,0.87,0,0,0,2.21,0,0,2.2999999999999998]
[null,"6.6.40 - Skyvedørskarmer",null,null,null,33,0,null,0,0,0,0,0,0,0,0,0,0,0,0,0,0,0,0,0,0,0,0,0,0,0,0,0,0,0,0,0,0,0,0,0]
[null,"6.6.50 - Rørsystem Ventilasjon og sentralstøvsuger",null,null,null,34,0,null,0,0,0,0,0,0,0,0,0,0,0,0,0,0,0,0,0,0,0,0,0,0,0,0,0,0,0,0,0,0,0,0,0]
[null,"6.6.90 - Ledig",null,null,null,35,0,null,0,0,0,0,0,0,0,0,0,0,0,0,0,0,0,0,0,0,0,0,0,0,0,0,0,0,0,0,0,0,0,0,0]
["6.7 - Ferdigstillelse",null,null,null,null,36,0]
[null,"6.7.10 - Innvendige plater og panel",null,null,null,37,0,null,0,0,0,0,0,0,0,0,0,0,0,0,0,0,0,0,0,0,0,0.93,1.49,1.1200000000000001,1.43,1.25,1.99,0.59,0,0,0,1.49,0,0,1.87]
[null,"6.7.20 - Gulvbord og parkett",null,null,null,38,0,null,0,0,0,0,0,0,0,0,0,0,0,0,0,0,0,0,0,0,0,0,0,0,0,0,0,0,0,0,0,0,0,0,0]
{"$rows_left_out":72}
{"sheet":"Timeverksrapport","index":2,"n_rows":81,"n_cols":12,"rows_kept":81,"cut":false,"hidden":false,"merged":[[1,6,4,8],[5,2,6,11],[8,10,11,11],[9,5,9,8],[10,5,10,8],[11,5,11,8],[19,2,19,6],[25,2,25,6],[41,2,41,6],[51,2,51,6],[60,2,60,6]]}
[]
[null,null,null,null,null,null,"Budsjettrapport"]
[null,null,null,null,null,null,null,null,null,null,"Kalkyledato :","2024-12-10"]
[null,null,null,null,null,null,null,null,null,null,"Revisjonsdato :"]
[]
[null,null,"BYGGER'N GARASJER - TØMRERTIMER"]
[]
[]
[null,null,null,null,"Hustype :",null,null,null,null,{"$f":"HLOOKUP(Tabell!$BB$2,Tabell!$G$1:$BH$49,49,FALSE)","v":19.8},{"$f":"HLOOKUP(Tabell!$BB$2,Tabell!$G$1:$BI$51,51,FALSE)","v":{"$error":"#VALUE!"}},{"$f":"HLOOKUP(Tabell!$BB$2,Tabell!$G$1:$BH$49,70,FALSE)","v":{"$error":"#REF!"}}]
[null,null,null,null,"Prosjektnr :",null,null,null,null,null,{"$f":"HLOOKUP(Tabell!$BB$2,Tabell!$G$1:$BH$49,70,FALSE)","v":{"$error":"#REF!"}},{"$f":"HLOOKUP(Tabell!$BB$2,Tabell!$G$1:$BH$49,70,FALSE)","v":{"$error":"#REF!"}}]
[null,null,null,null,"Tiltakshaver :",null,null,null,null,null,{"$f":"HLOOKUP(Tabell!$BB$2,Tabell!$G$1:$BH$49,70,FALSE)","v":{"$error":"#REF!"}},{"$f":"HLOOKUP(Tabell!$BB$2,Tabell!$G$1:$BH$49,70,FALSE)","v":{"$error":"#REF!"}}]
[null,null,null,null,"Byggeadresse :",null,null,null,null,null,{"$f":"HLOOKUP(Tabell!$BB$2,Tabell!$G$1:$BH$49,70,FALSE)","v":{"$error":"#REF!"}},{"$f":"HLOOKUP(Tabell!$BB$2,Tabell!$G$1:$BH$49,70,FALSE)","v":{"$error":"#REF!"}}]
[]
[]
[null,null,"Tidsforbruk er kalkulert med grunnlag fra Akkordtariffen for tømrerfaget."]
[null,null,"Timeverkene er fordelt på ulike milepæler i prosjektet"]
[null,null,"Erfaringer og tilbakemeldinger tilsier at bedrifter som ikke har akkordarbeid i sin bedrift, bør øke timeverket med 20 – 30 %."]
[]
[null,null,"Milepæler",null,null,null,null,null,"Kalkulert","Justering","Ekstratimer","Sum"]
[null,null,"6.1 - Rigg og drift",null,null,null,null,null,{"$f":"SUM(I21:I24)","v":0},null,null,{"$f":"SUM(L21:L24)","v":0}]
[null,null,null,"6.1.20 - Rigg og drift av byggeplass",null,null,null,null,{"$f":"HLOOKUP(Tabell!$BB$2,Tabell!$G$1:$BH$48,3,FALSE)","v":0},0,0,{"$f":"I21+(I21*J21)+K21","v":0}]
[null,null,null,"6.1.40 - Riving og klargjøring",null,null,null,null,{"$f":"HLOOKUP(Tabell!$BB$2,Tabell!$G$1:$BH$48,4,FALSE)","v":0},0,0,{"$f":"I22+(I22*J22)+K22","v":0}]
[null,null,null,"6.1.50 - Stillasjer",null,null,null,null,{"$f":"HLOOKUP(Tabell!$BB$2,Tabell!$G$1:$BH$48,5,FALSE)","v":0},0,0,0]
[null,null,null,"6.1.80 - Ledig",null,null,null,null,{"$f":"HLOOKUP(Tabell!$BB$2,Tabell!$G$1:$BH$48,6,FALSE)","v":0},0,0,0]
[]
[null,null,"6.4 - Tett råbygg",null,null,null,null,null,{"$f":"SUM(I27:I40)","v":27.450000000000003},null,null,{"$f":"SUM(L27:L40)","v":27.450000000000003}]
[null,null,null,"6.4.10 - Svillunderlag og bunnsvill",null,null,null,null,{"$f":"HLOOKUP(Tabell!$BB$2,Tabell!$G$1:$BH$48,7,FALSE)","v":1.48},0,0,1.48]
[null,null,null,"6.4.20 - Bindingsverk i yttervegger",null,null,null,null,{"$f":"HLOOKUP(Tabell!$BB$2,Tabell!$G$1:$BH$48,8,FALSE)","v":8.99},0,0,8.99]
[null,null,null,"6.4.22 - Bindingsverk i innvendige bærevegger",null,null,null,null,{"$f":"HLOOKUP(Tabell!$BB$2,Tabell!$G$1:$BH$48,9,FALSE)","v":0},0,0,0]
[null,null,null,"6.4.24 - Søyler og dragere",null,null,null,null,{"$f":"HLOOKUP(Tabell!$BB$2,Tabell!$G$1:$BH$48,10,FALSE)","v":0},0,0,0]
[null,null,null,"6.4.30 - Bjelkelag",null,null,null,null,{"$f":"HLOOKUP(Tabell!$BB$2,Tabell!$G$1:$BH$48,11,FALSE)","v":0},0,0,0]
[null,null,null,"6.4.32 - Takbjelkelag",null,null,null,null,{"$f":"HLOOKUP(Tabell!$BB$2,Tabell!$G$1:$BH$48,12,FALSE)","v":0},0,0,0]
[null,null,null,"6.4.34 - Plattformgulv",null,null,null,null,{"$f":"HLOOKUP(Tabell!$BB$2,Tabell!$G$1:$BH$48,13,FALSE)","v":0},0,0,0]
[null,null,null,"6.4.40 - Taksperrer",null,null,null,null,{"$f":"HLOOKUP(Tabell!$BB$2,Tabell!$G$1:$BH$48,14,FALSE)","v":0},0,0,0]
[null,null,null,"6.4.42 - Takstoler",null,null,null,null,{"$f":"HLOOKUP(Tabell!$BB$2,Tabell!$G$1:$BH$48,15,FALSE)","v":7.46},0,0,7.46]
[null,null,null,"6.4.50 - Vindtettplater/vindsperre og sløyfer",null,null,null,null,{"$f":"HLOOKUP(Tabell!$BB$2,Tabell!$G$1:$BH$48,16,FALSE)","v":0},0,0,0]
[null,null,null,"6.4.52 - Undertak og sløyfer",null,null,null,null,{"$f":"HLOOKUP(Tabell!$BB$2,Tabell!$G$1:$BH$48,17,FALSE)","v":1.21},0,0,1.21]
[null,null,null,"6.4.60 - Vindu og dører med tetting",null,null,null,null,{"$f":"HLOOKUP(Tabell!$BB$2,Tabell!$G$1:$BH$48,18,FALSE)","v":8.31},0,0,8.31]
[null,null,null,"6.4.70 - Ledig",null,null,null,null,{"$f":"HLOOKUP(Tabell!$BB$2,Tabell!$G$1:$BH$48,19,FALSE)","v":0},0,0,0]
[null,null,null,"6.4.80 - Montering elementer",null,null,null,null,{"$f":"HLOOKUP(Tabell!$BB$2,Tabell!$G$1:$BH$48,20,FALSE)","v":0},0,0,0]
{"$rows_left_out":42}
{"sheet":"Prisliste byggesett","index":3,"n_rows":66,"n_cols":7,"rows_kept":66,"cut":false,"hidden":true,"merged":[[3,6,5,9],[63,1,67,4],[62,1,62,2],[5,2,5,4],[4,2,4,4],[3,2,3,4]]}
[]
[-4146]
[]
[null,null,"PRISLISTE BYGGER'N GARASJER",null,null,null,"Om det er foretatt endringer/justeringer i arkfane Budsjettrapport, er det nødvendig å trykke Oppdater for at disse endringene skal bli gjeldende for prisliste."]
[null,null,"Byggesett"]
[null,null,"Firmanavn"]
[]
[]
[null,null,"Prisliste utarbeidet",{"$f":"Timeverksrapport!#REF!","v":{"$error":"#REF!"}},{"$f":"Timeverksrapport!#REF!","v":{"$error":"#REF!"}}]
[null,null,{"$f":"TODAY()","v":"2025-03-18"}]
[]
[null,null,"Gjelder til"]
[null,null,{"$f":"C10+30","v":"2025-04-17"}]
[]
[null,null,"Garasjetype","m² BRA","Pris inkl. mva."]
[]
[null,{"$error":"#VALUE!"},null,19.8]
[null,{"$error":"#VALUE!"},null,19.8]
[null,{"$error":"#VALUE!"},null,19.8]
[null,{"$error":"#VALUE!"},null,19.8]
[null,{"$error":"#VALUE!"},null,30.6]
[null,{"$error":"#VALUE!"},null,21.8]
[null,{"$error":"#VALUE!"},null,25.6]
[null,{"$error":"#VALUE!"},null,20.2]
[null,{"$error":"#VALUE!"},null,22.3]
[null,{"$error":"#VALUE!"},null,25.6]
[null,{"$error":"#VALUE!"},null,33.700000000000003]
[null,{"$error":"#VALUE!"},null,33.700000000000003]
[null,{"$error":"#VALUE!"},null,37.200000000000003]
[null,{"$error":"#VALUE!"},null,33.700000000000003]
[null,{"$error":"#VALUE!"},null,46.6]
[null,{"$error":"#VALUE!"},null,25.6]
[null,{"$error":"#VALUE!"},null,37.200000000000003]
[null,{"$error":"#VALUE!"},null,33]
[null,{"$error":"#VALUE!"},null,37.200000000000003]
[null,{"$error":"#VALUE!"},null,30.1]
[null,{"$error":"#VALUE!"},null,36.700000000000003]
[null,{"$error":"#VALUE!"},null,34.5]
[null,{"$error":"#VALUE!"},null,33.1]
[null,{"$error":"#VALUE!"},null,28.4]
{"$rows_left_out":26}