{"text_format":"1","workbook":"xlsx","n_sheets":4,"sheets":["Inndata budsjett","Tabell","Budsjettrapport","Prisliste byggesett"],"not_rendered":{"charts":0,"images":37,"macros":1,"external_links":0,"defined_names":13,"comments":0,"pivot_tables":0},"unopened":[],"bounds":{"document_bytes":16777216,"sheet_cells":100000,"rows_first":2000,"rows_last":500,"rows_between":2000,"halvings":0,"cell_chars":16384,"cell_head_chars":4096},"cells_cut":0,"cells_raw":0,"read":"whole","date_system":"1900"}

{"sheet":"Inndata budsjett","index":0,"n_rows":75,"n_cols":28,"rows_kept":75,"cut":false,"hidden":true,"merged":[[23,0,23,4],[33,0,33,4],[2,0,2,4],[38,0,38,4],[48,0,48,4]]}
[]
["Materialer",null,null,null,null,null,null,null,null,null,"Lim inn alt i celle K4:",null,3,4,5,6,7,8,9,10,11,12,13,14,15,16,17,18]
["MATERIALER"]
[4004,"YTTERDØRER",null,null,null,1,{"$f":"IF(H4=1,I4,)","v":0},{"$f":"COUNT(I4)","v":0},{"$f":"VLOOKUP(4004,$K$4:$AD$110,4,FALSE)","v":{"$error":"#N/A"}}]
[4010,"BYGNINGSPLATER,",null,null,null,2,0,0,{"$f":"VLOOKUP(4010,$K$4:$AD$110,4,FALSE)","v":{"$error":"#N/A"}}]
[4011,"PAPP, FOLIE OG MEMBRAN",null,null,null,3,0,0,{"$f":"VLOOKUP(4011,$K$4:$AD$110,4,FALSE)","v":{"$error":"#N/A"}}]
[4012,"SPIKER, SKRUER, LIM, BESL",null,null,null,4,0,0,{"$f":"VLOOKUP(4012,$K$4:$AD$110,4,FALSE)","v":{"$error":"#N/A"}}]
[4013,"ISOLASJON",null,null,null,5,0,0,{"$f":"VLOOKUP(4013,$K$4:$AD$110,4,FALSE)","v":{"$error":"#N/A"}}]
[4014,"TAKTEKKING, STEIN/METALL",null,null,null,6,0,0,{"$f":"VLOOKUP(4014,$K$4:$AD$110,4,FALSE)","v":{"$error":"#N/A"}}]
[4015,"TAKRENNER MED TILBEHØR",null,null,null,7,0,0,{"$f":"VLOOKUP(4015,$K$4:$AD$110,4,FALSE)","v":{"$error":"#N/A"}}]
[4017,"BRANNVARSLER/SLUKKER",null,null,null,8,0,0,{"$f":"VLOOKUP(4017,$K$4:$AD$110,4,FALSE)","v":{"$error":"#N/A"}}]
[4020,"STÅLPROFILER",null,null,null,9,0,0,{"$f":"VLOOKUP(4020,$K$4:$AD$110,4,FALSE)","v":{"$error":"#N/A"}}]
[4022,"TAKVINDUER",null,null,null,10,0,0,{"$f":"VLOOKUP(4022,$K$4:$AD$110,4,FALSE)","v":{"$error":"#N/A"}}]
[4023,"OVN, PEIS, STÅLPIPE",null,null,null,11,0,0,{"$f":"VLOOKUP(4023,$K$4:$AD$110,4,FALSE)","v":{"$error":"#N/A"}}]
[4024,"BESLAG",null,null,null,12,0,0,{"$f":"VLOOKUP(4024,$K$4:$AD$110,4,FALSE)","v":{"$error":"#N/A"}}]
[4025,"INNVENDIGE DØRER",null,null,null,13,0,0,{"$f":"VLOOKUP(4025,$K$4:$AD$110,4,FALSE)","v":{"$error":"#N/A"}}]
[4026,"GLASS OG METALLPROFILER",null,null,null,14,0,0,{"$f":"VLOOKUP(4026,$K$4:$AD$110,4,FALSE)","v":{"$error":"#N/A"}}]
[4029,"GARASJEPORTER",null,null,null,15,0,0,{"$f":"VLOOKUP(4029,$K$4:$AD$110,4,FALSE)","v":{"$error":"#N/A"}}]
[4030,"LIMTRE OG KERTO",null,null,null,16,0,0,{"$f":"VLOOKUP(4030,$K$4:$AD$110,4,FALSE)","v":{"$error":"#N/A"}}]
[4031,"TRELAST",null,null,null,17,0,0,{"$f":"VLOOKUP(4031,$K$4:$AD$110,4,FALSE)","v":{"$error":"#N/A"}}]
[4033,"PARKETT OG GULVBORD",null,null,null,18,0,0,{"$f":"VLOOKUP(4033,$K$4:$AD$110,4,FALSE)","v":{"$error":"#N/A"}}]
[4034,"LISTVERK",null,null,null,19,0,0,{"$f":"VLOOKUP(4034,$K$4:$AD$110,4,FALSE)","v":{"$error":"#N/A"}}]
[4049,"STØVAVSUG",null,null,null,20,0,0,{"$f":"VLOOKUP(4049,$K$4:$AD$110,4,FALSE)","v":{"$error":"#N/A"}}]
["ORDRESTYRTE LEVERANSER",null,null,null,null,21]
[4106,"TAKSTOLER/TAKVERK",null,null,null,22,0,0,{"$f":"VLOOKUP(4106,$K$4:$AD$110,4,FALSE)","v":{"$error":"#N/A"}}]
[4107,"VINDUER OG BALKONGDØRER",null,null,null,23,0,0,{"$f":"VLOOKUP(4107,$K$4:$AD$110,4,FALSE)","v":{"$error":"#N/A"}}]
[4109,"INNVENDIGE TRAPPER",null,null,null,24,0,0,{"$f":"VLOOKUP(4109,$K$4:$AD$110,4,FALSE)","v":{"$error":"#N/A"}}]
[4127,"KONSTRUKSJONSPAKKE VEGG/BJELKELAG/TAK",null,null,null,25,0,0,{"$f":"VLOOKUP(4127,$K$4:$AD$110,4,FALSE)","v":{"$error":"#N/A"}}]
[4132,"I-TREBJELKER",null,null,null,26,0,0,{"$f":"VLOOKUP(4132,$K$4:$AD$110,4,FALSE)","v":{"$error":"#N/A"}}]
[4148,"VENTILASJON",null,null,null,27,0,0,{"$f":"VLOOKUP(4148,$K$4:$AD$110,4,FALSE)","v":{"$error":"#N/A"}}]
[4150,"GARDEROBEINNREDNING",null,null,null,28,0,0,{"$f":"VLOOKUP(4150,$K$4:$AD$110,4,FALSE)","v":{"$error":"#N/A"}}]
[4151,"KJØKKENINNREDNING",null,null,null,29,0,0,{"$f":"VLOOKUP(4151,$K$4:$AD$110,4,FALSE)","v":{"$error":"#N/A"}}]
[4152,"BADEROMSINNREDNING",null,null,null,30,0,0,{"$f":"VLOOKUP(4152,$K$4:$AD$110,4,FALSE)","v":{"$error":"#N/A"}}]
["ANNET",null,null,null,null,31]
[4413,"FORSIKRINGER /GARANTIER",null,null,null,32,0,0,{"$f":"VLOOKUP(4413,$K$4:$AD$110,4,FALSE)","v":{"$error":"#N/A"}}]
[4415,"FRAKTUTGIFTER",null,null,null,33,0,0,{"$f":"VLOOKUP(4415,$K$4:$AD$110,4,FALSE)","v":{"$error":"#N/A"}}]
[4464,"PROSJEKTERING KONTR.ANSV.",null,null,null,34,0,0,{"$f":"VLOOKUP(4464,$K$4:$AD$110,4,FALSE)","v":{"$error":"#N/A"}}]
[4479,"RIGG OG DRIFT",null,null,null,35,0,0,{"$f":"VLOOKUP(4479,$K$4:$AD$110,4,FALSE)","v":{"$error":"#N/A"}}]
["TIMEVERK",null,null,null,null,36]
["5.1","PROSJEKTERING",null,null,null,37,0,{"$f":"COUNT(I40)","v":0},{"$f":"VLOOKUP(\"3.1 Prosjektering\",$L$4:$AB$70,3,FALSE)","v":{"$error":"#N/A"}}]
{"$rows_left_out":36}
{"sheet":"Tabell","index":1,"n_rows":132,"n_cols":61,"rows_kept":132,"cut":false,"hidden":true,"merged":[[1,0,1,4],[22,0,22,4],[32,0,32,4],[37,0,37,4],[47,0,47,4]]}
["Materialer",null,null,null,null,null,1,2,3,4,5,6,7,8,9,10,11,12,13,14,15,16,17,18,19,20,21,22,23,24,25,26,27,28,29,30,31,32,33,34,35,36,37,38,39,40,41,42,43,44,45,46,47]
["MATERIALER",null,null,null,null,null,{"$f":"B80","v":"Velg garasjetype"},null,{"$f":"B82","v":"GA 101 S-W - Enkel garasje"},{"$f":"B83","v":"GA 102 S-W - Enkel garasje"},{"$f":"B84","v":"GA 103 V-W - Enkel garasje"},{"$f":"B85","v":"GA 104 HV-W - Enkel garasje"},{"$f":"B86","v":"GA 106 S-W - Enkel garasje"},{"$f":"B87","v":"GA 107 S-W - Enkel carport"},{"$f":"B88","v":"GA 108 S-W - Enkel garasje"},{"$f":"B89","v":"GA 109 S-W - Enkel garasje"},{"$f":"B90","v":"GA 111 F - Enkel carport"},{"$f":"B91","v":"GA 112 F - Enkel garasje"},{"$f":"$B92","v":"GA 201 S-W - Dobbel garasje"},{"$f":"$B93","v":"GA 202 S-W - Dobbel garasje"},{"$f":"$B94","v":"GA 203 V-W - Dobbel garasje"},{"$f":"$B95","v":"GA 204 HV-W - Dobbel garasje"},{"$f":"$B96","v":"GA 206 S-W - Dobbel garasje"},{"$f":"$B97","v":"GA 207 P - Enkel garasje m/ carpor"},{"$f":"$B98","v":"GA 208 S-W - Dobbel garasje"},{"$f":"$B99","v":"GA 209 S-W - Dobbel garasje"},{"$f":"$B100","v":"GA 211 F - Dobbel garasje"},{"$f":"$B101","v":"GA 301 S-W - Enkel garasje m/bod"},{"$f":"$B102","v":"GA 302 S-W - Enkel garasje m/bod"},{"$f":"$B103","v":"GA 303 V-W - Enkel garasje m/bod"},{"$f":"$B104","v":"GA 305 P - Enkel garasje m/bod"},{"$f":"$B105","v":"GA 307 P - Enkel garasje m/bod"},{"$f":"$B106","v":"GA 308 F - Dobbel garasje m/ bod"},{"$f":"$B107","v":"GA 309 P - Carport m/ bod"},{"$f":"$B108","v":"GA 310 F - Carport m/ bod"},{"$f":"$B109","v":"GA 311 F - Carport m/ bod"},{"$f":"$B110","v":"GA 401 S-A - Dobbel garasje m/ hems"},{"$f":"$B111","v":"GA 402 S-A - Dobbel garasje m/ hems"},{"$f":"$B112","v":"GA 403 S-A - Dobbel garasje m/ hems"},{"$f":"$B113","v":"GA 404 HV-A - Dobbel garasje m/ hems"},{"$f":"$B114","v":"GA 405 S-A - Dobbel garasje m/ hems"},{"$f":"$B115","v":0},{"$f":"$B116","v":0},{"$f":"$B117","v":0},{"$f":"$B118","v":0},{"$f":"$B119","v":0},{"$f":"$B120","v":0},{"$f":"$B121","v":0},{"$f":"$B122","v":0},{"$f":"$B123","v":0},{"$f":"$B124","v":0},{"$f":"$B125","v":0},34,27,null,null,null,null,null,null,51]
[4004,"YTTERDØRER",null,null,null,1,0,null,0,0,0,0,5287.26,0,0,0,0,5287.26,0,0,0,0,5287.26,0,0,0,5287.26,5287.26,5287.26,0,5287.26,5287.26,5287.26,17542.52,5287.26,5287.26,0,5287.26,0,5287.26,5287.26]
[4010,"BYGNINGSPLATER,",null,null,null,2,0,null,2213.66,2495.86,2527.21,2709.07,3474.13,2477.04,3367.53,2615.0100000000002,10583.77,10909.92,3304.82,2922.29,4333.26,3756.33,4935.28,3831.58,4540.2,3831.58,13251.01,3855.05,4470.5600000000004,4783.6000000000004,4164.2,3587.02,15171.74,2856.27,12762.26,11536.04,7306.96,11074.86,7959.28,8914.89,12475.82]
[4011,"PAPP, FOLIE OG MEMBRAN",null,null,null,3,0,null,461.59,461.59,461.59,461.59,692.5,599.49,527.91999999999996,494.76,4963.05,6858.58,519.63,519.63,550.04,519.63,644.01,527.91999999999996,580.44000000000005,555.55999999999995,9368.65,677.15,743.46,721.37,749,668.85,10569.86,566.6,6363.42,6262.09,522.4,809.8,508.58,624.66,1011.56]
[4012,"SPIKER, SKRUER, LIM, BESL",null,null,null,4,0,null,8955.94,9107.98,8762.91,9133.16,11592.07,6395.23,8964.77,5911.34,5668.04,7007.36,10740.28,10601.04,11513.08,11129.69,12987.39,11940.14,12758.72,7036.81,7146.16,10730.52,10831.66,11672.6,11386.04,10677.59,8746.66,11633.76,6590.26,7399.59,11501.11,14522.88,12112.89,12757.12,15113.51]
[4013,"ISOLASJON",null,null,null,5,0,null,0,0,0,0,0,0,0,0,0,0,0,0,0,0,0,0,0,0,0,0,0,0,0,0,0,0,0,0,0,0,0,0,0]
[4014,"TAKTEKKING, STEIN/METALL",null,null,null,6,0,null,17346.52,14279.89,28317.19,26406.67,18738.38,18435.689999999999,22293.45,18496.59,0,0,20740.03,19564.78,39725.06,26213.39,27384.03,20579.240000000002,24714.02,20984.59,0,22499.37,21405.07,40735.760000000002,18250.55,10176.209999999999,0,12009.2,0,0,21455.5,31689.8,23160.43,31572.71,31720.799999999999]
[4015,"TAKRENNER MED TILBEHØR",null,null,null,7,0,null,4029.01,3163.28,7261.37,5295.23,3625,4279.1000000000004,4529.2,4048.23,1393.17,1286.72,4048.23,4048.23,8434.9,5387.92,4644.63,4067.48,4548.4399999999996,4067.48,1819.02,4760.05,4298.33,8608.0400000000009,3817.38,2293.4499999999998,1925.49,1616.67,1410.92,1410.92,4048.23,5221.7700000000004,4737.32,5702.73,4952.42]
[4017,"BRANNVARSLER/SLUKKER",null,null,null,8,0,null,0,0,0,0,0,0,0,0,0,0,0,0,0,0,0,0,0,0,0,0,0,0,0,0,0,0,0,0,0,0,0,0,0]
[4020,"STÅLPROFILER",null,null,null,9,0,null,0,0,0,0,0,0,0,0,0,240.46,0,0,0,0,0,0,0,0,31105.62,0,0,0,0,0,23003.14,0,0,0,0,0,0,0,0]
[4022,"TAKVINDUER",null,null,null,10,0,null,0,0,0,0,0,0,0,0,0,0,0,0,0,0,0,0,0,0,0,0,0,0,0,0,0,0,0,0,0,0,0,0,0]
[4023,"OVN, PEIS, STÅLPIPE",null,null,null,11,0,null,0,0,0,0,0,0,0,0,0,0,0,0,0,0,0,0,0,0,0,0,0,0,0,0,0,0,0,0,0,0,0,0,0]
[4024,"BESLAG",null,null,null,12,0,null,0,0,0,0,0,0,0,0,0,0,0,0,0,0,0,573.24,0,0,0,0,0,0,515.91999999999996,0,0,0,0,0,0,0,286.62,0,0]
[4025,"INNVENDIGE DØRER",null,null,null,13,0,null,0,0,0,0,0,0,0,0,0,0,0,0,0,0,0,0,0,0,0,0,0,0,0,0,2316.38,0,0,0,0,0,0,0,0]
[4026,"GLASS OG METALLPROFILER",null,null,null,14,0,null,0,0,0,0,0,0,0,0,0,0,0,0,0,0,0,0,0,0,0,0,0,0,0,0,0,0,0,0,0,0,0,0,0]
[4029,"GARASJEPORTER",null,null,null,15,0,null,11532.42,11532.42,11532.42,11532.42,11532.42,0,11532.42,11532.42,0,12902.27,23064.84,23064.84,23064.84,23064.84,23064.84,23064.84,20545.12,23064.84,20595.099999999999,11532.42,11532.42,11532.42,11532.42,12902.27,20595.099999999999,0,0,0,23064.84,23064.84,20088.54,23064.84,11532.42]
[4030,"LIMTRE OG KERTO",null,null,null,16,0,null,0,0,0,0,1767,10642.22,0,0,9432.09,4464.4799999999996,0,2499.62,2588.89,0,0,4725.37,0,0,3381.12,0,1339.07,2873.92,0,0,4129.01,6836.29,16450.7,0,0,0,0,0,8771.4500000000007]
[4031,"TRELAST",null,null,null,17,0,null,19171.5,20136.060000000001,18368.46,19838.490000000002,27986.7,13810.36,35210.519999999997,9236.73,14977.06,22865.59,24175.49,23665.439999999999,24151.52,25449.16,32580.35,30562.959999999999,44107.64,13464.77,24632.6,25507.21,28667.11,27524.82,29288.19,29225.98,33967.519999999997,25278.94,21227.09,27870.68,29329.78,35797.279999999999,31245.65,31520.34,47162.92]
[4033,"PARKETT OG GULVBORD",null,null,null,18,0,null,0,0,0,0,0,0,0,0,0,0,0,0,0,0,0,0,0,0,0,0,0,0,0,0,0,0,0,0,0,0,0,0,0]
[4034,"LISTVERK",null,null,null,19,0,null,0,0,0,0,0,0,0,0,0,0,0,0,0,0,0,0,0,0,0,0,0,0,0,0,0,0,0,0,0,0,0,0,0]
[4049,"STØVAVSUG",null,null,null,20,0,null,0,0,0,0,0,0,0,0,0,0,0,0,0,0,0,0,0,0,0,0,0,0,0,0,0,0,0,0,0,0,0,0,0]
["ORDRESTYRTE LEVERANSER",null,null,null,null,21,0]
[4106,"TAKSTOLER/TAKVERK",null,null,null,22,0,null,11520,20400,18487,16640,20095,12160,16680,13440,8445,8445,14506,30431,27458,21760,28800,13909,21120,18560,8145,14720,15755,24200,10685,12639,8045,6674,5548,5018,20240,28158,35198,27518,39898]
[4107,"VINDUER OG BALKONGDØRER",null,null,null,23,0,null,2599.1,2599.1,2599.1,2599.1,3898.65,0,2599.1,2599.1,0,1299.55,2599.1,2599.1,2599.1,2599.1,3898.65,5047.6000000000004,2599.1,2599.1,2377.67,2599.1,5198.2,2599.1,10265.469999999999,5600,4755.34,6880,0,0,8036.1,8036.1,13064.6,3898.65,10635.2]
[4109,"INNVENDIGE TRAPPER",null,null,null,24,0,null,0,0,0,0,0,0,0,0,0,0,0,0,0,0,0,0,0,0,0,0,0,0,0,0,0,0,0,0,0,0,0,0,0]
[4127,"KONSTRUKSJONSPAKKE VEGG/BJELKELAG/TAK",null,null,null,25,0,null,0,0,0,0,0,0,0,0,0,0,0,0,0,0,0,0,0,0,0,0,0,0,0,0,0,0,0,0,0,0,0,0,0]
[4132,"I-TREBJELKER",null,null,null,26,0,null,0,0,0,0,0,0,0,0,0,0,0,0,0,0,0,0,0,0,0,0,0,0,0,0,0,0,0,0,0,0,0,0,0]
[4148,"VENTILASJON",null,null,null,27,0,null,0,0,0,0,0,0,0,0,0,0,0,0,0,0,0,0,0,0,0,0,0,0,0,0,0,0,0,0,0,0,0,0,0]
[4150,"GARDEROBEINNREDNING",null,null,null,28,0,null,0,0,0,0,0,0,0,0,0,0,0,0,0,0,0,0,0,0,0,0,0,0,0,0,0,0,0,0,0,0,0,0,0]
[4151,"KJØKKENINNREDNING",null,null,null,29,0,null,0,0,0,0,0,0,0,0,0,0,0,0,0,0,0,0,0,0,0,0,0,0,0,0,0,0,0,0,0,0,0,0,0]
[4152,"BADEROMSINNREDNING",null,null,null,30,0,null,0,0,0,0,0,0,0,0,0,0,0,0,0,0,0,0,0,0,0,0,0,0,0,0,0,0,0,0,0,0,0,0,0]
["ANNET",null,null,null,null,31,0]
[4413,"FORSIKRINGER /GARANTIER",null,null,null,32,0,null,0,0,0,0,0,0,0,0,0,0,0,0,0,0,0,0,0,0,0,0,0,0,0,0,0,0,0,0,0,0,0,0,0]
[4415,"FRAKTUTGIFTER",null,null,null,33,0,null,0,0,0,0,0,0,0,0,0,0,0,0,0,0,0,0,0,0,0,0,0,0,0,0,0,0,0,0,0,0,0,0,0]
[4464,"PROSJEKTERING KONTR.ANSV.",null,null,null,34,0,null,0,0,0,0,0,0,0,0,0,0,0,0,0,0,0,0,0,0,0,0,0,0,0,0,0,0,0,0,0,0,0,0,0]
[4479,"RIGG OG DRIFT",null,null,null,35,0,null,0,0,0,0,0,0,0,0,0,0,0,0,0,0,0,0,0,0,0,0,0,0,0,0,0,0,0,0,0,0,0,0,0]
["TIMEVERK",null,null,null,null,36,0]
["5.1","PROSJEKTERING",null,null,null,37,0,null,0,0,0,0,0,0,0,0,0,0,0,0,0,0,0,0,0,0,0,0,0,0,0,0,0,0,0,0,0,0,0,0,0]
["6.1","RIGG OG DRIFT",null,null,null,38,0,null,0,0,0,0,0,0,0,0,0,0,0,0,0,0,0,0,0,0,0,0,0,0,0,0,0,0,0,0,0,0,0,0,0]
{"$rows_left_out":93}
{"sheet":"Budsjettrapport","index":2,"n_rows":70,"n_cols":16,"rows_kept":70,"cut":false,"hidden":false,"merged":[[1,6,4,8],[5,2,6,11],[16,11,18,11],[16,9,16,10],[17,9,17,10],[18,8,18,9],[8,10,11,11],[9,5,9,8],[10,5,10,8],[11,5,11,8],[49,3,49,6],[20,4,20,6],[20,8,20,9],[25,13,25,15],[46,2,46,6],[26,2,26,6],[40,2,40,6]]}
[]
[null,null,null,null,null,null,"Budsjettrapport"]
[null,null,null,null,null,null,null,null,null,null,"Kalkyledato :","2024-10-31"]
[null,null,null,null,null,null,null,null,null,null,"Revisjonsdato :"]
[]
[null,null,"BYGGER'N GARASJER"]
[]
[]
[null,null,null,null,"Hustype :",null,null,null,null,{"$f":"HLOOKUP(Tabell!$BB$2,Tabell!$G$1:$BH$70,70,FALSE)","v":45.4},{"$f":"HLOOKUP(Tabell!$BB$2,Tabell!$G$1:$BI$72,72,FALSE)","v":{"$error":"#VALUE!"}},{"$f":"HLOOKUP(Tabell!$BB$2,Tabell!$G$1:$BH$70,70,FALSE)","v":45.4}]
[null,null,null,null,"Prosjektnr :",null,null,null,null,null,{"$f":"HLOOKUP(Tabell!$BB$2,Tabell!$G$1:$BH$70,70,FALSE)","v":45.4},{"$f":"HLOOKUP(Tabell!$BB$2,Tabell!$G$1:$BH$70,70,FALSE)","v":45.4}]
[null,null,null,null,"Tiltakshaver :",null,null,null,null,null,{"$f":"HLOOKUP(Tabell!$BB$2,Tabell!$G$1:$BH$70,70,FALSE)","v":45.4},{"$f":"HLOOKUP(Tabell!$BB$2,Tabell!$G$1:$BH$70,70,FALSE)","v":45.4}]
[null,null,null,null,"Byggeadresse :",null,null,null,null,null,{"$f":"HLOOKUP(Tabell!$BB$2,Tabell!$G$1:$BH$70,70,FALSE)","v":45.4},{"$f":"HLOOKUP(Tabell!$BB$2,Tabell!$G$1:$BH$70,70,FALSE)","v":45.4}]
[]
[]
[null,null,"Byggekostnadsindeks : Enebolig i tre, kun materialer"]
[]
[null,null,null,null,null,null,"Basis indeks :",177.9,"Indeksdato :","2024-04-01",null,"Finn siste indeks her"]
[null,null,null,null,null,null,"Dagens indeks :",178.6,"Indeksdato :","2024-09-01"]
[null,null,null,null,null,null,"Prisstigning :",{"$f":"((H18-H17)/H17)","v":3.9347948285553044E-3}]
[]
[null,null,"PÅSLAG",null,"Kalkulert",null,null,null,"Justert"]
[]
[null,null,null,null,"Påslag materialer:",33,"%",null,33,"%"]
[]
[]
[null,null,"Netto kostnader",null,null,null,null,null,"Kalkulert","Justering","Ekstrakost","Sum",null,"Inngår i byggesett"]
[null,null,"MATERIALER (direkte, lager og skaffevarer)",null,null,null,null,null,{"$f":"SUM(I28:I39)","v":125712.16},null,null,{"$f":"SUM(L28:L39)","v":126206.81155705451},null,null,null,{"$f":"SUM(P28:P39)","v":126206.81155705451}]
[null,null,4004,"YTTERDØRER",null,null,null,{"$f":"IF(L28=0,0,1)","v":1},{"$f":"HLOOKUP(Tabell!$BB$2,Tabell!$G$1:$BH$68,3,FALSE)","v":5287.26},0,0,{"$f":"(((I28*(1+$H$19))+((I28*(1+$H$19))*J28))+K28)","v":5308.0642833052279},null,{"$f":"_xlfn.IFS(O28=Tabell!$B$131,1,O28=Tabell!$B$132,0)","v":1},"Ja",{"$f":"L28*N28","v":5308.0642833052279}]
[null,null,4010,"BYGNINGSPLATER,",null,null,null,{"$f":"IF(L29=0,0,1)","v":1},{"$f":"HLOOKUP(Tabell!$BB$2,Tabell!$G$1:$BH$68,4,FALSE)","v":15171.74},0,0,15231.437684092185,null,{"$f":"_xlfn.IFS(O29=Tabell!$B$131,1,O29=Tabell!$B$132,0)","v":1},"Ja",{"$f":"L29*N29","v":15231.437684092185}]
[null,null,4011,"PAPP, FOLIE OG MEMBRAN",null,null,null,1,{"$f":"HLOOKUP(Tabell!$BB$2,Tabell!$G$1:$BH$68,5,FALSE)","v":10569.86},0,0,10611.450230466555,null,{"$f":"_xlfn.IFS(O30=Tabell!$B$131,1,O30=Tabell!$B$132,0)","v":1},"Ja",10611.450230466555]
[null,null,4012,"SPIKER, SKRUER, LIM, BYGNINGSBESLAG",null,null,null,1,{"$f":"HLOOKUP(Tabell!$BB$2,Tabell!$G$1:$BH$68,6,FALSE)","v":8746.66},0,0,8781.0763125351314,null,{"$f":"_xlfn.IFS(O31=Tabell!$B$131,1,O31=Tabell!$B$132,0)","v":1},"Ja",8781.0763125351314]
[null,null,4014,"TAKTEKKING, STEIN/METALL",null,null,null,0,{"$f":"HLOOKUP(Tabell!$BB$2,Tabell!$G$1:$BH$68,8,FALSE)","v":0},0,0,0,null,{"$f":"_xlfn.IFS(O32=Tabell!$B$131,1,O32=Tabell!$B$132,0)","v":1},"Ja",0]
[null,null,4015,"TAKRENNER MED TILBEHØR",null,null,null,1,{"$f":"HLOOKUP(Tabell!$BB$2,Tabell!$G$1:$BH$68,9,FALSE)","v":1925.49},0,0,1933.066408094435,null,{"$f":"_xlfn.IFS(O33=Tabell!$B$131,1,O33=Tabell!$B$132,0)","v":1},"Ja",1933.066408094435]
[null,null,4020,"STÅLPROFILER",null,null,null,1,{"$f":"HLOOKUP(Tabell!$BB$2,Tabell!$G$1:$BH$68,11,FALSE)","v":23003.14},0,0,23093.652636312534,null,{"$f":"_xlfn.IFS(O34=Tabell!$B$131,1,O34=Tabell!$B$132,0)","v":1},"Ja",23093.652636312534]
[null,null,4024,"BESLAG",null,null,null,0,{"$f":"HLOOKUP(Tabell!$BB$2,Tabell!$G$1:$BH$68,14,FALSE)","v":0},0,0,0,null,{"$f":"_xlfn.IFS(O35=Tabell!$B$131,1,O35=Tabell!$B$132,0)","v":1},"Ja",0]
[null,null,4025,"INNVENDIGE DØRER",null,null,null,1,{"$f":"HLOOKUP(Tabell!$BB$2,Tabell!$G$1:$BH$68,15,FALSE)","v":2316.38},0,0,2325.4944800449689,null,{"$f":"_xlfn.IFS(O36=Tabell!$B$131,1,O36=Tabell!$B$132,0)","v":1},"Ja",2325.4944800449689]
[null,null,4029,"GARASJEPORTER",null,null,null,1,{"$f":"HLOOKUP(Tabell!$BB$2,Tabell!$G$1:$BH$68,17,FALSE)","v":20595.099999999999},0,0,20676.137492973579,null,{"$f":"_xlfn.IFS(O37=Tabell!$B$131,1,O37=Tabell!$B$132,0)","v":1},"Ja",20676.137492973579]
[null,null,4030,"LIMTRE OG KERTO",null,null,null,1,{"$f":"HLOOKUP(Tabell!$BB$2,Tabell!$G$1:$BH$68,18,FALSE)","v":4129.01},0,0,4145.2568071950536,null,{"$f":"_xlfn.IFS(O38=Tabell!$B$131,1,O38=Tabell!$B$132,0)","v":1},"Ja",4145.2568071950536]
[null,null,4031,"TRELAST",null,null,null,1,{"$f":"HLOOKUP(Tabell!$BB$2,Tabell!$G$1:$BH$68,19,FALSE)","v":33967.519999999997},0,0,34101.175222034843,null,{"$f":"_xlfn.IFS(O39=Tabell!$B$131,1,O39=Tabell!$B$132,0)","v":1},"Ja",34101.175222034843]
[]
{"$rows_left_out":31}
{"sheet":"Prisliste byggesett","index":3,"n_rows":66,"n_cols":7,"rows_kept":66,"cut":false,"hidden":false,"merged":[[3,6,5,9],[63,1,67,4],[62,1,62,2],[5,2,5,4],[4,2,4,4],[3,2,3,4]]}
[]
[-4146]
[]
[null,null,"PRISLISTE BYGGER'N GARASJER",null,null,null,"Om det er foretatt endringer/justeringer i arkfane Budsjettrapport, er det nødvendig å trykke Oppdater for at disse endringene skal bli gjeldende for prisliste."]
[null,null,"Byggesett"]
[null,null,"Firmanavn"]
[]
[]
[null,null,"Prisliste utarbeidet",{"$f":"Budsjettrapport!I18","v":"Indeksdato :"},{"$f":"Budsjettrapport!J18","v":"2024-09-01"}]
[null,null,{"$f":"TODAY()","v":"2025-03-18"}]
[]
[null,null,"Gjelder til"]
[null,null,{"$f":"C10+30","v":"2025-04-17"}]
[]
[null,null,"Garasjetype","m² BRA","Pris inkl. mva."]
[]
[null,{"$error":"#VALUE!"},"GA 101 S-W - Enkel garasje",19.8,129901.0735]
[null,{"$error":"#VALUE!"},"GA 102 S-W - Enkel garasje",19.8,140493.54579999999]
[null,{"$error":"#VALUE!"},"GA 103 V-W - Enkel garasje",19.8,164095.57990000001]
[null,{"$error":"#VALUE!"},"GA 104 HV-W - Enkel garasje",19.8,157917.58900000001]
[null,{"$error":"#VALUE!"},"GA 106 S-W - Enkel garasje",30.6,181406.64569999999]
[null,{"$error":"#VALUE!"},"GA 107 S-W - Enkel carport",21.8,114828.60980000001]
[null,{"$error":"#VALUE!"},"GA 108 S-W - Enkel garasje",25.6,176425.89170000001]
[null,{"$error":"#VALUE!"},"GA 109 S-W - Enkel garasje",20.2,114119.3505]
[null,{"$error":"#VALUE!"},"GA 111 F - Enkel carport",22.3,92568.685400000002]
[null,{"$error":"#VALUE!"},"GA 112 F - Enkel garasje",25.6,136139.033]
[null,{"$error":"#VALUE!"},"GA 201 S-W - Dobbel garasje",33.700000000000003,173076.97649999999]
[null,{"$error":"#VALUE!"},"GA 202 S-W - Dobbel garasje",33.700000000000003,200144.742]
[null,{"$error":"#VALUE!"},"GA 203 V-W - Dobbel garasje",37.200000000000003,241040.8009]
[null,{"$error":"#VALUE!"},"GA 204 HV-W - Dobbel garasje",33.700000000000003,200084.80669999999]
[null,{"$error":"#VALUE!"},"GA 206 S-W - Dobbel garasje",46.6,240719.9277]
[null,{"$error":"#VALUE!"},"GA 207 P - Enkel garasje m/ carpor",25.6,198331.16140000001]
[null,{"$error":"#VALUE!"},"GA 208 S-W - Dobbel garasje",37.200000000000003,226177.9688]
[null,{"$error":"#VALUE!"},"GA 209 S-W - Dobbel garasje",33,157164.85130000001]
[null,{"$error":"#VALUE!"},"GA 211 F - Dobbel garasje",37.200000000000003,212150.5588]
[null,{"$error":"#VALUE!"},"GA 301 S-W - Enkel garasje m/bod",30.1,170522.85879999999]
[null,{"$error":"#VALUE!"},"GA 302 S-W - Enkel garasje m/bod",36.700000000000003,182807.02160000001]
[null,{"$error":"#VALUE!"},"GA 303 V-W - Enkel garasje m/bod",34.5,225740.59650000001]
[null,{"$error":"#VALUE!"},"GA 305 P - Enkel garasje m/bod",33.1,176820.65349999999]
[null,{"$error":"#VALUE!"},"GA 307 P - Enkel garasje m/bod",28.4,155317.05530000001]
{"$rows_left_out":26}